3.8K Star 12.8K Fork 4.8K

卓源软件 / JeeSite 4.3

 / 详情

maven检出时缺少依赖包?

Backlog
Opened this issue  
2021-09-19 01:52

mvn install时出现如下报错信息,始终搞不定。maven版本3.8.2

[INFO] ------------------< com.jeesite:jeesite-module-core >-------------------
[INFO] Building JeeSite Module Core 4.3.0-SNAPSHOT [3/6]
[INFO] --------------------------------[ jar ]---------------------------------
[INFO] ------------------------------------------------------------------------
[INFO] Reactor Summary for JeeSite 4.3.0-SNAPSHOT:
[INFO]
[INFO] JeeSite Parent ..................................... SUCCESS [ 0.372 s]
[INFO] JeeSite Common ..................................... SUCCESS [ 13.270 s]
[INFO] JeeSite Module Core ................................ FAILURE [ 0.487 s]
[INFO] JeeSite Module CMS ................................. SKIPPED
[INFO] JeeSite Web ........................................ SKIPPED
[INFO] JeeSite ............................................ SKIPPED
[INFO] ------------------------------------------------------------------------
[INFO] BUILD FAILURE
[INFO] ------------------------------------------------------------------------
[INFO] Total time: 14.605 s
[INFO] Finished at: 2021-09-19T01:48:45+08:00
[INFO] ------------------------------------------------------------------------
[ERROR] Failed to execute goal on project jeesite-module-core: Could not resolve dependencies for project com.jeesite:jeesite-module-core:jar:4.3.0-SNAPSHOT: The following artifacts could not be resolved: com.sun:tools:jar:1.8, com.sun:jconsole:jar:1.8: Could not find artifact com.sun:tools:jar:1.8 at specified path D:\apache-maven-3.8.2\maven-repository\com\alibaba\druid\1.2.6/lib/openjdk-1.8-tools.jar -> [Help 1]
[ERROR]
[ERROR] To see the full stack trace of the errors, re-run Maven with the -e switch.
[ERROR] Re-run Maven using the -X switch to enable full debug logging.
[ERROR]
[ERROR] For more information about the errors and possible solutions, please read the following articles:
[ERROR] [Help 1] http://cwiki.apache.org/confluence/display/MAVEN/DependencyResolutionException
[ERROR]
[ERROR] After correcting the problems, you can resume the build with the command
[ERROR] mvn -rf :jeesite-module-core

Comments (0)

夏泽睿 created任务
夏泽睿 set related repository to 卓源软件/JeeSite 4.3
Expand operation logs

Sign in to comment

Status
Assignees
Milestones
Pull Requests
Successfully merging a pull request will close this issue.
Branches
Planed to start   -   Planed to end
-
Top level
Priority
参与者(1)
Java
1
https://gitee.com/thinkgem/jeesite4.git
git@gitee.com:thinkgem/jeesite4.git
thinkgem
jeesite4
JeeSite 4.3

Search